{"text_format":"1","workbook":"xlsx","n_sheets":5,"sheets":["Instructions","WCCL-FA1","WCCL-FA2","WCCL-FA3","WCCL-FA4"],"not_rendered":{"charts":0,"images":2,"macros":1,"external_links":0,"defined_names":0,"comments":0,"pivot_tables":0},"unopened":[],"bounds":{"document_bytes":16777216,"sheet_cells":100000,"rows_first":2000,"rows_last":500,"rows_between":2000,"halvings":0,"cell_chars":16384,"cell_head_chars":4096},"cells_cut":0,"cells_raw":0,"read":"whole","date_system":"1900"}

{"sheet":"Instructions","index":0,"n_rows":14,"n_cols":2,"rows_kept":14,"cut":false,"hidden":false,"merged":[[13,1,13,7],[5,0,11,7],[0,0,3,7],[4,0,4,7],[12,0,12,7]]}
["MACROS MUST BE ENABLED TO USE THIS WORKSHEET"]
[]
[]
[]
["Instructions:"]
["This worksheet relies on macros to function properly. Please ensure that you have macros enabled in order to complete this worksheet.\n\nThese forms are used to apply for approval of a test stand to conduct witness testing for the AHRI WCCL Certification program.  Each tab contains a different sheet. Please ensure the form is signed after completion and before submission. Once complete and signed, please email the form to chillerscert@ahrinet.org"]
[]
[]
[]
[]
[]
[]
["Cells:"]
["Yellow","Yellow cells require input from the user"]

{"sheet":"WCCL-FA1","index":1,"n_rows":81,"n_cols":11,"rows_kept":81,"cut":false,"hidden":false,"merged":[[13,3,13,4],[50,1,50,7],[45,6,45,7],[51,1,51,7],[52,1,52,7],[19,1,19,4],[19,5,19,9],[26,1,27,10],[49,1,49,10],[14,3,14,4],[20,1,20,4],[25,3,25,4],[24,5,24,9],[25,5,25,9],[28,1,28,3],[13,5,13,9],[0,1,4,4],[0,5,4,10],[5,1,10,10],[12,1,12,4],[12,5,12,9],[11,5,11,9],[11,2,11,4],[74,7,74,10],[68,1,70,10],[72,1,74,5],[54,1,54,7],[55,1,55,7],[59,9,63,9],[59,10,63,10],[57,1,58,7],[57,8,58,8],[57,9,58,9],[80,1,83,10],[64,1,64,7],[66,6,66,10],[30,1,30,2],[30,3,33,10],[35,1,35,2],[57,10,58,10],[56,1,56,7],[45,3,45,5],[47,1,47,10],[76,7,76,10],[77,7,77,10],[35,3,38,10],[75,1,77,5],[75,7,75,10],[40,1,40,2],[14,5,14,9],[15,5,15,9],[16,5,16,9],[17,5,17,9],[18,5,18,9],[20,5,20,9],[72,7,72,10],[73,7,73,10],[59,1,63,7],[59,8,63,8],[40,3,43,10],[22,1,23,10],[53,1,53,7]]}
[null,null,null,null,null,"FORM WCCL-FA1\nWCCL APPLICATION FOR TEST STAND APPROVAL\nAHRI CERTIFICATION PROGRAM FOR\nWATER-COOLED WATER CHILLING AND HEAT PUMP WATER-HEATING (WCCL) PACKAGES"]
[]
[]
[]
[]
[null,"We, the undersigned, hereby request AHRI to approve our test stand for the purpose of conducting performance certification tests in accordance with the AHRI Certification Program for Water-Cooled Water-Chilling and Heat Pump Water-Heating Packages Using the Vapor Compression Cycle (WCCL). All testing will be conducted in accordance with the latest edition of AHRI Standard 550/590 (I-P), AHRI Standard 551/591 (SI) or EN Standards 14511 and 14825 and witnessed by the Independent Third-Party Laboratory contracted by AHRI."]
[]
[]
[]
[]
[]
[null,null,"Company (Participant) Name:"]
[null,"Test Facility Name (Site or Building):"]
[null,null,null,"Street Address:"]
[]
[null,null,null,null,"City:"]
[null,null,null,null,"State or Province:"]
[null,null,null,null,"Country:"]
[null,null,null,null,"ZIP Code:"]
[null,"Test Stand Name (Unique Identifier):"]
[null,"New Test Stand or Renewal?",null,null,null,{"$f":"IF(K21=\"\",\"\")","v":""}]
[]
[null,"Upon successful completion of the facility inspection, a certificate will be sent to the certification contact(s) on file with AHRI. If you would like it to be sent to an additional contact within the company, please indicate below."]
[]
[null,null,null,null,"Name:"]
[null,null,null,"Email Address:"]
[null,"Indicate one of the three Approval Categories below, and submit the applicable Forms and documentation:"]
[]
[null,"Category Descriptions:"]
[]
[null,"Category 1 =",null,"Test Stand Approval to be compliant with the latest edition of AHRI Standard 550/590\n(I-P) or AHRI Standard 551/591 (SI). This includes the initial approval, approval after\nexpiration of an approval, and approval after physical and/or operational changes are\nmade which impact results of a previous Category 1 approval."]
[]
[]
[]
[]
[null,"Category 2 =",null,"Approval of revised capacity limits on a Test Stand with a current Category 1\nApproval, to be compliant with the latest edition of AHRI Standard 550/590 (I-P) or\nAHRI Standard 551/591 (SI). An approval in this category does not modify the\nexpiration date of the Category 1 approval."]
[]
[]
[]
[]
[null,"Category 3 =",null,"Test Stand Approval to be compliant with the latest edition of EN Standards 14511 and\n14825. This includes the initial approval, approval after expiration of an approval, and\napproval after physical and/or operational changes are made which impact results of a\nprevious Category 3 approval."]
[]
[]
[]
[]
[null,null,null,"Facility Inspection Category:"]
[]
[null,"Please submit all required forms for the chosen category of facility inspection as found below."]
[]
[null,"APPROVAL CATEGORIES"]
[null,"Requirements",null,null,null,null,null,null,"Category 1","Category 2","Category 3"]
[null,"Form WCCL-FA1 Application",null,null,null,null,null,null,"■","■","■"]
[null,"Form WCCL-FA2 Personnel Experience Questionnaire",null,null,null,null,null,null,"■",null,"■"]
[null,"Form WCCL-FA3 Test Stand and Equipment Questionnaire",null,null,null,null,null,null,"■","■"]
[null,"Form WCCL-FA4 Calibration Summary",null,null,null,null,null,null,"■"]
[null,"Copy of each calibration report showing last dates of calibration",null,null,null,null,null,null,"■","■","■"]
[null,"AHRI System Calibration Worksheet (Available on AHRI Website)",null,null,null,null,null,null,"■","■"]
[null,"Schematic drawing of the area of the test stand in which AHRI certification testing will be performed",null,null,null,null,null,null,"■ ",null,"■ "]
[]
[null,"Photographs of the test stand in which AHRI certification testing will take place (which shall include sufficient views to show the location and connection of each instrument as well as the location and connection of the ports to be used by the Laboratory during witness testing)",null,null,null,null,null,null,"■ ",null,"■ "]
[]
[]
[]
[]
[null,"DS2 Test Stand Inspection Workbook",null,null,null,null,null,null,"■","■","■"]
[]
[null,null,null,null,null,null,"(“■” indicates the item is required for the category)"]
[]
[null,"In signing this form and submitting all information requested above, I acknowledge that the Test Stand is in conformance with all of the provisions of the latest edition of AHRI Standard 550/590 (I-P), AHRI Standard 551/591 (SI) or EN Standards 14511 and 14825."]
[]
[]
[]
[]
[null,null,null,null,null,null,null,"Printed Name"]
[]
[null,"Signature of Certification Program Compliance Officer or Lab Manager",null,null,null,null,null,"Title"]
[]
[null,null,null,null,null,null,null,"Date"]
[]
[]
{"$rows_left_out":2}
{"sheet":"WCCL-FA2","index":2,"n_rows":36,"n_cols":6,"rows_kept":36,"cut":false,"hidden":false,"merged":[[32,4,32,5],[35,4,35,5],[33,1,34,8],[12,0,14,8],[16,0,16,3],[24,0,24,3],[25,0,27,3],[19,0,19,3],[22,0,22,3],[18,0,18,3],[21,0,21,3],[16,5,16,8],[18,5,18,8],[21,5,21,8],[22,5,22,8],[24,5,24,8],[25,5,27,8],[30,1,31,8],[0,0,4,3],[6,0,6,4],[10,0,10,4],[9,0,9,8],[0,4,4,8],[19,5,19,8]]}
[null,null,null,null,"FORM WCCL-FA2\nWCCL PERSONNEL EXPERIENCE QUESTIONNAIRE\nAHRI CERTIFICATION PROGRAM FOR WATER-COOLED WATER CHILLING AND HEAT PUMP WATER-HEATING\n(WCCL) PACKAGES"]
[]
[]
[]
[]
[]
[{"$f":"IF('WCCL-FA1'!F12=\"\",\"\",'WCCL-FA1'!F12)","v":""}]
["Company (Participant) Name"]
[]
[{"$f":"IF('WCCL-FA1'!F20=\"\",\"\",'WCCL-FA1'!F20)","v":""}]
["Test Stand Name (Unique Identifier)"]
[]
["The following personnel are directly responsible for conducting the testing that will be witnessed at the Participant’s test stand in accordance with the AHRI Water-Cooled Water-Chilling and Heat Pump Water Heating Packages Using the Vapor Compression Cycle Certification Program:"]
[]
[]
[]
["Primary Contact",null,null,null,null,"Secondary Contact (Optional)"]
[]
[]
["Name",null,null,null,null,"Name "]
[]
[]
["Title",null,null,null,null,"Title"]
[]
["Area of Responsibility for Certification Testing:",null,null,null,null,"Area of Responsibility for Certification Testing:"]
[]
[]
[]
[]
["Test Technicians:"]
["1.","Are your Test Technicians required to complete all training prior to conducting chiller testing?"]
[]
[null,null,null,null,{"$f":"IF(G33=\"\",\"\")","v":""}]
["2.","Have you defined a minimum level of competency that your Test Technicians must exhibit prior to conducting chiller performance testing?"]
[]
[null,null,null,null,{"$f":"IF(G36=\"\",\"\")","v":""}]

{"sheet":"WCCL-FA3","index":3,"n_rows":175,"n_cols":10,"rows_kept":175,"cut":false,"hidden":false,"merged":[[63,1,65,10],[143,7,145,9],[146,7,146,9],[147,7,147,9],[148,7,148,9],[149,7,149,9],[150,7,150,9],[83,2,83,3],[85,2,85,3],[110,2,110,3],[112,2,112,3],[99,6,99,7],[100,6,100,7],[101,6,101,7],[102,6,102,7],[103,6,103,7],[99,8,99,9],[100,8,100,9],[101,8,101,9],[102,8,102,9],[103,8,103,9],[102,1,102,2],[102,4,102,5],[107,1,107,10],[66,2,66,3],[77,9,77,10],[73,5,73,6],[74,5,74,6],[75,5,75,6],[76,5,76,6],[77,5,77,6],[96,6,98,7],[96,8,98,9],[73,1,73,2],[74,1,74,2],[75,1,75,2],[76,1,76,2],[78,1,78,2],[81,1,81,10],[69,1,69,3],[70,1,72,2],[70,3,72,3],[70,4,72,4],[70,5,72,6],[70,7,72,8],[70,9,72,10],[73,7,73,8],[74,7,74,8],[0,1,4,4],[0,5,4,10],[6,1,6,5],[7,1,7,4],[9,1,9,10],[10,1,10,5],[15,6,18,7],[19,6,19,7],[20,6,20,7],[12,1,12,3],[13,1,14,2],[13,3,13,5],[14,3,14,5],[15,1,16,2],[15,3,15,5],[16,3,16,5],[15,8,15,10],[16,8,16,10],[17,8,17,10],[18,8,18,10],[19,1,22,2],[19,3,20,5],[21,3,22,5],[19,8,19,10],[21,6,21,7],[22,6,22,7],[23,6,23,7],[24,6,24,7],[25,6,25,7],[30,8,30,9],[31,6,31,7],[31,8,31,9],[32,8,32,9],[33,8,33,9],[23,1,25,2],[23,3,25,5],[27,1,27,3],[28,1,29,5],[28,8,28,9],[29,6,29,7],[29,8,29,9],[28,6,28,7],[23,8,23,9],[24,8,24,9],[25,8,25,9],[47,1,47,4],[48,1,50,3],[48,4,50,5],[48,6,50,7],[51,1,51,3],[51,4,51,5],[51,6,51,7],[30,1,31,5],[30,6,30,7],[32,1,33,5],[32,6,32,7],[33,6,33,7],[48,8,50,9],[51,8,51,9],[52,8,52,9],[53,8,53,9],[60,1,60,5],[61,1,61,10],[54,1,54,3],[56,1,56,7],[57,1,57,10],[58,1,58,7],[59,1,59,10],[54,4,54,9],[52,1,52,3],[52,4,52,5],[52,6,52,7],[53,2,53,3],[53,4,53,5],[53,6,53,7],[75,7,75,8],[76,7,76,8],[77,7,77,8],[78,3,78,10],[73,9,73,10],[74,9,74,10],[75,9,75,10],[76,9,76,10],[82,1,82,8],[87,1,87,10],[89,1,89,10],[95,1,95,4],[96,1,98,2],[96,3,98,3],[96,4,98,5],[101,1,101,2],[101,4,101,5],[99,1,99,2],[99,4,99,5],[100,1,100,2],[100,4,100,5],[103,4,103,5],[104,1,104,2],[104,3,104,9],[118,1,118,2],[118,4,118,6],[119,1,119,2],[119,4,119,6],[106,1,106,5],[108,1,108,10],[115,7,117,8],[115,9,117,10],[118,9,118,10],[119,9,119,10],[120,9,120,10],[118,7,118,8],[119,7,119,8],[120,7,120,8],[109,1,109,9],[111,1,111,10],[121,4,121,6],[122,1,122,2],[125,1,125,3],[126,1,128,2],[126,3,128,4],[126,5,128,6],[120,1,120,2],[120,4,120,6],[114,1,114,3],[115,1,117,2],[115,3,117,3],[115,4,117,6],[133,3,133,4],[133,5,133,6],[132,7,132,9],[133,7,133,9],[142,1,142,3],[167,1,168,10],[170,1,171,10],[129,1,129,2],[129,3,129,4],[129,5,129,6],[130,5,130,6],[131,1,131,2],[131,3,131,4],[131,5,131,6],[130,7,130,9],[131,7,131,9],[132,1,132,2],[132,3,132,4],[132,5,132,6],[175,1,175,10],[164,1,164,8],[165,1,165,10],[169,1,169,10],[20,8,20,10],[21,8,21,10],[22,8,22,10],[148,1,148,2],[148,3,148,4],[148,5,148,6],[173,1,173,3],[152,1,152,5],[163,1,163,3],[143,1,145,2],[143,3,145,4],[143,5,145,6],[146,1,146,2],[146,3,146,4],[146,5,146,6],[147,1,147,2],[147,3,147,4],[172,1,172,10],[130,1,130,2],[130,3,130,4],[13,6,14,7],[13,8,13,10],[14,8,14,10],[17,1,18,2],[18,3,18,5],[17,3,17,5],[174,1,174,9],[147,5,147,6],[154,1,154,9],[155,1,155,10],[156,1,156,9],[157,1,157,10],[149,1,149,2],[149,3,149,4],[149,5,149,6],[150,3,150,4],[150,5,150,6],[121,9,121,10],[122,3,122,10],[121,7,121,8],[126,7,128,9],[129,7,129,9],[153,2,153,3],[160,2,160,3]]}
[null,null,null,null,null,"FORM WCCL-FA3\nWCCL TEST STAND AND EQUIPMENT QUESTIONNAIRE\nAHRI CERTIFICATION PROGRAM FOR WATER-COOLED WATER\nCHILLING AND HEAT PUMP WATER-HEATING (WCCL) PACKAGES"]
[]
[]
[]
[]
[]
[null,{"$f":"IF('WCCL-FA1'!F12=\"\",\"\",'WCCL-FA1'!F12)","v":""}]
[null,"Company (Participant) Name"]
[]
[null,{"$f":"IF('WCCL-FA1'!F20=\"\",\"\",'WCCL-FA1'!F20)","v":""}]
[null,"Test Stand Name (Unique Identifier)"]
[]
[null,"1. Test Stand Limitations"]
[null,"Operating Range of Test Stand",null,"Minimum Cooling Capacity",null,null,"Indicate Tons or kW"]
[null,null,null,"Maximum Cooling Capacity"]
[null,"Evaporator Water Flow Rate",null,"Minimum",null,null,"Indicate GPM or L/s"]
[null,null,null,"Maximum"]
[null,"Condenser Water Flow Rate",null,"Minimum"]
[null,null,null,"Maximum"]
[null,"Power Supply",null,"60 Hz, 3 Phase",null,null,"Volts"]
[null,null,null,null,null,null,"Max Amps"]
[null,null,null,"50 Hz, 3 Phase",null,null,"Volts"]
[null,null,null,null,null,null,"Max Amps"]
[null,"Physical Size",null,"Dimensions of largest unit you can place in your test stand (indicate ft or m)",null,null,"Length"]
[null,null,null,null,null,null,"Height"]
[null,null,null,null,null,null,"Width"]
[]
[null,"2. Time Requirements"]
[null,"How long does it take to install and fully instrument a unit for test?",null,null,null,null,"# of Persons"]
[null,null,null,null,null,null,"Total # of man-hours"]
[null,"How long does it take to conduct a standard rating test from start to finish, including calculations?",null,null,null,null,"# of Persons"]
[null,null,null,null,null,null,"Total # of man-hours"]
[null,"How many shifts per day will you employ for witness testing?",null,null,null,null,"Length of shift, hrs."]
[null,null,null,null,null,null,"# of shifts"]
[]
[]
[]
[]
[]
[]
[]
[]
[]
[]
[]
[]
[]
[null,"3. Water Temperature Measurement"]
[null,"Instruments for determining water temperature",null,null,"Instrument Accuracy",null,"Frequency of calibration, months",null,"Is the primary standard traceable to NIST or a comparable National Standard? (Yes/No)"]
[]
[]
[null,"RTD",null,null,null,null,null,null,{"$f":"IF(K51=\"\",\"\")","v":""}]
[null,"Thermocouple",null,null,null,null,null,null,{"$f":"IF(K52=\"\",\"\")","v":""}]
[null,"Other:",null,null,null,null,null,null,""]
[null,"Data Acquisition Type"]
[]
[null,"Where do you place your water temperature measuring instruments?"]
[]
[null,"What type of mixing device do you employ in the chilled water medium?"]
[]
[null,"The mixing device conforms to which standard?"]
[]
[]
[null,"4. Does your system have additional thermowells located near the entering and leaving water temperature sensors capable of accommodating ¼ inch Laboratory probes with immersion depths of 1/3 to ½ the diameter of the pipe?"]
[]
[]
[null,"Response:",{"$f":"IF(H67=\"\",\"\")","v":""}]
[]
[]
[null,"5. Flow Measurement"]
[null,"Flow Measuring Instruments Used",null,"Instrument\nAccuracy","Diameter","Frequency of Calibration, months",null,"To what code\nstandard(s), if any,\nis the instrument\ninstalled?",null,"Is the primary standard traceable to NIST or a comparable National Standard? (Yes/No)"]
[]
[]
[null,"Rota Meter",null,null,null,null,null,null,null,{"$f":"IF(L73=\"\",\"\")","v":""}]
[null,"Turbine Meter",null,null,null,null,null,null,null,{"$f":"IF(L74=\"\",\"\")","v":""}]
[null,"Orifice Meter",null,null,null,null,null,null,null,{"$f":"IF(L75=\"\",\"\")","v":""}]
[null,"Magnetic Meter",null,null,null,"N/A",null,null,null,{"$f":"IF(L76=\"\",\"\")","v":""}]
[null,"Other:",null,null,null,null,null,null,null,{"$f":"IF(L77=\"\",\"\")","v":""}]
[null,"Data Acquisition Type"]
[]
{"$rows_left_out":96}
{"sheet":"WCCL-FA4","index":4,"n_rows":313,"n_cols":9,"rows_kept":313,"cut":false,"hidden":false,"merged":[[213,0,215,9],[216,0,216,6],[216,7,216,8],[218,0,218,8],[219,1,221,8],[252,4,252,5],[255,0,256,9],[257,0,257,6],[257,7,257,8],[237,0,237,9],[238,1,238,3],[239,0,239,1],[239,2,239,6],[239,7,239,9],[240,0,240,1],[240,2,240,6],[240,7,240,9],[235,0,235,9],[243,0,243,1],[243,2,243,6],[243,7,243,9],[244,0,244,1],[244,2,244,6],[244,7,244,9],[72,0,74,9],[75,0,75,6],[75,7,75,8],[77,0,77,8],[78,1,80,8],[111,4,111,5],[114,0,115,9],[116,0,116,6],[116,7,116,8],[96,0,96,9],[97,1,97,3],[98,0,98,1],[98,2,98,6],[98,7,98,9],[99,0,99,1],[99,2,99,6],[99,7,99,9],[94,0,94,9],[102,0,102,1],[102,2,102,6],[102,7,102,9],[103,0,103,1],[103,2,103,6],[103,7,103,9],[0,0,4,3],[0,4,4,9],[9,0,9,9],[11,0,11,9],[12,1,12,3],[13,0,13,1],[13,2,13,6],[13,7,13,9],[25,4,25,5],[16,0,16,1],[16,2,16,6],[16,7,16,9],[17,0,17,1],[17,2,17,6],[17,7,17,9],[14,0,14,1],[14,2,14,6],[14,7,14,9],[15,0,15,1],[15,2,15,6],[15,7,15,9],[20,0,20,1],[20,2,20,6],[20,7,20,9],[22,0,22,4],[22,5,22,6],[24,0,24,9],[18,0,18,1],[18,2,18,6],[18,7,18,9],[19,0,19,1],[19,2,19,6],[19,7,19,9],[33,0,35,9],[38,0,38,8],[39,1,41,8],[28,0,29,9],[30,0,30,6],[30,7,30,8],[36,0,36,6],[36,7,36,8],[52,0,52,1],[52,2,52,6],[52,7,52,9],[53,0,53,1],[53,2,53,6],[53,7,53,9],[47,0,47,9],[49,0,49,9],[50,1,50,3],[51,0,51,1],[51,2,51,6],[51,7,51,9],[56,0,56,1],[56,2,56,6],[56,7,56,9],[57,0,57,1],[57,2,57,6],[57,7,57,9],[54,0,54,1],[54,2,54,6],[54,7,54,9],[55,0,55,1],[55,2,55,6],[55,7,55,9],[58,0,58,1],[58,2,58,6],[58,7,58,9],[61,0,61,4],[61,5,61,6],[63,0,63,9],[64,4,64,5],[67,0,68,9],[69,0,69,6],[69,7,69,8],[100,0,100,1],[100,2,100,6],[100,7,100,9],[101,0,101,1],[101,2,101,6],[101,7,101,9],[108,0,108,4],[108,5,108,6],[110,0,110,9],[104,0,104,1],[104,2,104,6],[104,7,104,9],[105,0,105,1],[105,2,105,6],[105,7,105,9],[141,0,141,9],[143,0,143,9],[144,1,144,3],[145,0,145,1],[145,2,145,6],[145,7,145,9],[119,0,121,9],[122,0,122,6],[122,7,122,8],[124,0,124,8],[125,1,127,8],[148,0,148,1],[148,2,148,6],[148,7,148,9],[149,0,149,1],[149,2,149,6],[149,7,149,9],[146,0,146,1],[146,2,146,6],[146,7,146,9],[147,0,147,1],[147,2,147,6],[147,7,147,9],[152,0,152,1],[152,2,152,6],[152,7,152,9],[155,0,155,4],[155,5,155,6],[157,0,157,9],[150,0,150,1],[150,2,150,6],[150,7,150,9],[151,0,151,1],[151,2,151,6],[151,7,151,9],[158,4,158,5],[161,0,162,9],[163,0,163,6],[163,7,163,8],[166,0,168,9],[169,0,169,6],[169,7,169,8],[171,0,171,8],[172,1,174,8],[193,0,193,1],[193,2,193,6],[193,7,193,9],[194,0,194,1],[194,2,194,6],[194,7,194,9],[188,0,188,9],[190,0,190,9],[191,1,191,3],[192,0,192,1],[192,2,192,6],[192,7,192,9],[197,0,197,1],[197,2,197,6],[197,7,197,9],[198,0,198,1],[198,2,198,6],[198,7,198,9],[195,0,195,1],[195,2,195,6],[195,7,195,9],[196,0,196,1],[196,2,196,6],[196,7,196,9],[199,0,199,1],[199,2,199,6],[199,7,199,9],[202,0,202,4],[202,5,202,6],[204,0,204,9],[205,4,205,5],[208,0,209,9],[210,0,210,6],[210,7,210,8],[241,0,241,1],[241,2,241,6],[241,7,241,9],[242,0,242,1],[242,2,242,6],[242,7,242,9],[249,0,249,4],[249,5,249,6],[251,0,251,9],[245,0,245,1],[245,2,245,6],[245,7,245,9],[246,0,246,1],[246,2,246,6],[246,7,246,9],[260,0,262,9],[263,0,263,6],[263,7,263,8],[265,0,265,8],[266,1,268,8],[293,0,293,1],[293,2,293,6],[293,7,293,9],[299,4,299,5],[290,2,290,6],[290,7,290,9],[284,0,284,9],[288,0,288,1],[288,2,288,6],[288,7,288,9],[282,0,282,9],[285,1,285,3],[286,0,286,1],[286,2,286,6],[286,7,286,9],[302,0,303,9],[304,0,304,6],[304,7,304,8],[307,0,309,9],[310,0,310,6],[310,7,310,8],[312,0,312,8],[313,1,315,8],[287,0,287,1],[287,2,287,6],[287,7,287,9],[296,0,296,4],[296,5,296,6],[298,0,298,9],[291,0,291,1],[291,2,291,6],[291,7,291,9],[292,0,292,1],[292,2,292,6],[292,7,292,9],[289,0,289,1],[289,2,289,6],[289,7,289,9],[290,0,290,1]]}
[null,null,null,null,"FORM WCCL-FA4\nWCCL CALIBRATION SUMMARY\nAHRI CERTIFICATION PROGRAM FOR WATER-COOLED WATER\nCHILLING AND HEAT PUMP WATER-HEATING (WCCL) PACKAGES"]
[]
[]
[]
[]
[]
["The purpose of this form is to provide sufficient information so that a determination can be made of the"]
["range over which the calibration process achieves the required accuracy for each of the systems listed."]
[]
["SYSTEM 1: LIQUID MASS FLOW RATE"]
[]
["1. Using the Table below, list all instruments and data acquisition devices in the System."]
[]
["Instrument/Device",null,"Description",null,null,null,null,"Manufacturer Stated Accuracy"]
[]
[]
[]
[]
[]
[]
[]
[]
["What is the intended range-of-use for the System?",null,null,null,null,"(Lower-Upper):",null,null,"-"]
[]
["Was the system calibrated as a whole, or were each instruments/devices calibrated individually?"]
[null,null,null,null,{"$f":"IF(H26=\"\",\"\")","v":""}]
[]
[]
["2. Whole System Calibration Points: Attach a completed AHRI Standard 550/590 (I-P) or AHRI Standard\n551/591 (SI) Calibration Worksheet (found online at www.ahrinet.org)"]
[]
["Does the System meet the required accuracy over the intended range-of-use?"]
[]
[]
["3. Individual Component Calibration Points: For each Instrument/Device listed in the Table above,\nattach a completed AHRI Standard 550/590 (I-P) or AHRI Standard 551/591 (SI) Calibration Worksheet\n(found online at www.ahrinet.org)."]
[]
[]
["Does the System meet the required accuracy over the intended range-of-use?"]
[]
["Describe the method of analysis used to make the determination of system accuracy:"]
[]
[]
[]
[]
[]
[]
[]
[]
["SYSTEM 2: DIFFERENTIAL PRESSURE"]
[]
["1. Using the Table below, list all instruments and data acquisition devices in the System."]
[]
["Instrument/Device",null,"Description",null,null,null,null,"Manufacturer Stated Accuracy"]
[]
[]
[]
[]
[]
[]
[]
[]
[]
["What is the intended range-of-use for the System?",null,null,null,null,"(Lower-Upper):",null,null,"-"]
[]
["Was the system calibrated as a whole, or were each instruments/devices calibrated individually?"]
[null,null,null,null,{"$f":"IF(G65=\"\",\"\")","v":""}]
[]
[]
["2. Whole System Calibration Points: Attach a completed AHRI Standard 550/590 (I-P) or AHRI Standard\n551/591 (SI) Calibration Worksheet (found online at www.ahrinet.org)"]
[]
["Does the System meet the required accuracy over the intended range-of-use?"]
[]
[]
["3. Individual Component Calibration Points: For each Instrument/Device listed in the Table above,\nattach a completed AHRI Standard 550/590 (I-P) or AHRI Standard 551/591 (SI) Calibration Worksheet\n(found online at www.ahrinet.org)."]
[]
[]
["Does the System meet the required accuracy over the intended range-of-use?"]
[]
["Describe the method of analysis used to make the determination of system accuracy:"]
[]
[]
{"$rows_left_out":233}